{"text_format":"1","workbook":"xlsx","n_sheets":11,"sheets":["HOME","1| Checklist Boiler System","Dropdown & Conversions","Steam and Water tables","2| Main Inputs","3| Boiler Cost & Efficiency","4| Combustion Efficiency","5| Steam Leakage Calculation","6| Insulation Thickness + Cost","7| Condensate Recovery","8| Economizer"],"not_rendered":{"charts":0,"images":5,"macros":1,"external_links":0,"defined_names":12,"comments":2,"pivot_tables":0},"unopened":[],"bounds":{"document_bytes":16777216,"sheet_cells":100000,"rows_first":2000,"rows_last":500,"rows_between":2000,"halvings":0,"cell_chars":16384,"cell_head_chars":4096},"cells_cut":0,"cells_raw":0,"read":"whole","date_system":"1900"}

{"sheet":"HOME","index":0,"n_rows":17,"n_cols":2,"rows_kept":17,"cut":false,"hidden":false,"merged":[[0,1,0,6],[14,1,14,5],[15,1,15,5],[16,1,16,2],[16,3,16,5],[8,1,8,5],[9,1,9,5],[10,1,10,5],[11,1,11,5],[12,1,12,5],[13,1,13,5],[2,1,2,5],[4,1,4,5],[6,1,6,5],[7,1,7,5],[3,1,3,5]]}
[null,"ENERGY EFFICIENCY TOOLS FOR BOILER AND STEAM SYSTEMS"]
[null,"VER_03/180519"]
[null,"INTRODUCTION: This workbook consists of multiple tools that conduct Assessment of Compressed Air System, calculate Energy Performance of Compressors, and calculate Energy Saving Potentials in Compressed Air System"]
[null,"INTRODUCTION: This workbook consists of multiple tools that conduct Assessment of Boilers and Steam System, calculate Energy Performance and Efficiency of Boilers, and calculate Energy Saving Potentials in the System."]
[]
[]
[null,"HOW TO USE:"]
[null,"1. Insert data from your company in cells that are highlighted in white.\n2. Results of calculations will be displayed in Orange Cells.\n3. Examples of Data and Calculation are shown in each tool."]
[null,"SOURCES:"]
[null,"1. Spirax Sarco Limited; http://www.spiraxsarco.com/pages/home.aspx   \n2. Improving Steam Boiler Operating Efficiency , by Enercon.gov.pk   \n3. Energy Technology Handbook, McGraw Hill, 9-46   \n4. Saturated Steam Table by Pressure; http://www.tlv.com/global/TI/calculator/steam-table-pressure.html   \n5. https://www.engineersedge.com/thermodynamics/steam_tables.htm   \n6. Properties of Saturated Steam; http://www.engineeringtoolbox.com/saturated-steam-properties-d_457.html   \n7. Water Thermal Properties; http://www.engineeringtoolbox.com/water-thermal-properties-d_162.html   \n8. www.enggcyclopedia.com/2011/09/sample-problem-insulation-thickness-calculation-pipe/   \n9. www.engineeringtoolbox.com/fiberglas-insulation-k-values-d_1172.html   \n10. www.engineeringtoolbox.com/mineral-wool-insulation-k-values-d_815.html   \n11. \"INSULATION AND REFRACTORIES\"  by Bureau of Energy Efficiency India page 122-128, pdhonline.org/cources/m157/m157 content.pdf   \n12. http://www.infrared-thermography.com/material.htm   \n13. Estimating of cost steam lost through orifices(By Henry Manczyk, CPE, CEM); http://www.swagelokenergy.com/download/ECSLTOST.pdf  \n14. Bureau of energy efficiency India \n15. Enorcon Pakistan \n16.  APO Japan\n17. Excel add-in for Steam and Water Tables \"Water97_v13.xla\"  by Bernhard Spang"]
[null,"WHO WE ARE:"]
[null,"ESPIRE Consult provides consulting and training services in the fields of Resource Efficiency and Business Management in The Islamic Republic of Pakistan. Using internationally certified methodologies and systems, we provide end-to-end tailor made solutions to improve resource efficiencies resulting in cost reduction and operational excellence.\n\nFrom 2008 tiill 2016, ESPIRE operated as a partnership project between the Training and Development Centers of the Bavarian Employers‘ Association (bfz) gGmbH and business associations in Lahore and Karachi in Pakistan and was funded by the German Federal Ministry for Economic Cooperation and Development (BMZ) via Sequa gGmbH. The objective of ESPIRE project was to support industries in Pakistan to work economically more efficiently and ecologically more sustainable and start making energy conservation and cleaner production part of their work routine. Main project partners were; Pakistan Association of Automotive Parts and Accessories Manufacturers (PAAPAM), Pakistan Hosiery Manufacturers Association (PHMA), Pakistan Readymade Garments Manufacturers and Exporters Association (PRGMEA), Small and Medium Enterprises Development Authority (SMEDA), Towel Manufacturers Association of Pakistan (TMA).\n\nThis tool is developed under the Project ESPIRE and updated, maintained and distributed by ESPIRE Consult free of cost."]
[null,"DISCLAIMER:"]
[null,"The information, calculations and conclusions in this tool are based on the projects executed by the experts and consultant under Project ESPIRE by bfz gGmbH – International Division. Some sources (as mentioned above) were also consulted to validate the contents. The efficiency improvement measures proposed in this tool are tested and tried in many companies in Pakistan. However, implementation of these measures in any particular case should be based on real time data analysis by qualified engineers after judging financial viability. ESPIRE Consult, Bfz gGmbH – International Division and it's Project Partners in Pakistan accepts no liability whatsoever to any person, company or entity for any injury, loss or damage that may arise in connection with any misuse or reliance on the information.\n\nThe tool is provided as a freeware. Users may make copies and distribute the tool without making any changes."]
[null,"CONTACT:"]
{"$rows_left_out":3}
{"sheet":"1| Checklist Boiler System","index":1,"n_rows":56,"n_cols":4,"rows_kept":56,"cut":false,"hidden":false,"merged":[[49,1,49,3],[1,1,1,3],[44,1,44,3],[45,2,45,3],[46,2,46,3],[47,2,47,3]]}
[]
[null,"CHECKLIST FOR HOT WATER & BOILER SYSTEM"]
[null,null,"ENERGY SAVING OPTIONS"]
[null,"LEVEL","PRODUCTION","RATING"]
[null,"-","Optimize boiler excess air, excess oxygen, and CO levels according to fuel type through boiler tuning based on Flue Gas Analysis [1% excess air reduction will increase 0.6% efficiency of combustion].","»"]
[null,"-","Insulate the Boiler surface completely and regularly monitor the surface temperatures to keep it close to Ambient Temperature.","»"]
[null,"-","Test Water Quality (feed water and Blow-down waste water) regularly to assess and maintain the efficiency of water treatment systems [Feed water and Blow-down TDS should be lesser than 100 ppm and 3500 ppm respectively].","»"]
[null,"-","Devise Blow-down cycle amounts and times based on water quality test to avoid the Blow-down loss.","»"]
[null,"-","Analyse the gap between the Generated and Demanded steam pressure and try to minimize it.","»"]
[null,"- -","Install automatic boiler Blow-down system.","»"]
[null,"- -","Separate fresh water from condensate water to avoid heat loss. Preheat fresh water before mixing with condensate water.","»"]
[null,"- -","Install stand-by feed water pump for contingency and to avoid any accidents.","»"]
[null,"- -","Keep stack temperature of Boiler as low as possible. Install a waste heat recovery system if the temperature of stack is more than 200°C.","»"]
[null,"- -","Install variable speed drives on Boiler Fans & Blowers.","»"]
[null,"- - -","Install waste heat recovery systems (exhaust air, blow-down) to preheat feed water or inlet air [20 degree Celsius rise in inlet air increases thermal efficiency by 1%].","»"]
{"$rows_left_out":42}
{"sheet":"Dropdown & Conversions","index":2,"n_rows":19,"n_cols":13,"rows_kept":19,"cut":false,"hidden":true,"merged":[[2,6,2,8]]}
[]
[]
[null,null,"Fuel","Price Unit","GCV","Net Heating Value","Converted Fuel Price by Volume",null,null,"Fuel Consumption Unit","Fuel per Ton of Steam","Hourly Fuel Consumption"]
[null,null,null,null,null,null,"Example Column","Data Column"]
[null,null,"Natural Gas","[Rs/mmbtu]","[btu/ft²]","[kW/m³]",{"$f":"IF('2| Main Inputs'!C24=\"Natural Gas\", ('2| Main Inputs'!C26*'2| Main Inputs'!C28*35.31/1000000), \"-\")","v":"-"},{"$f":"IF('2| Main Inputs'!E24=\"Natural Gas\", ('2| Main Inputs'!E26*'2| Main Inputs'!E28*35.31/1000000), \"-\")","v":"-"},"[Rs/m³]","[Sm³/mo]","[Sm³/Ton]","[Sm³/hr]","[mmbtu/y]"]
[null,null,"HFO","[Rs/kg]","[kJ/kg]","[kW/kg]",{"$f":"IF('2| Main Inputs'!C24=\"HFO\",('2| Main Inputs'!C26*1.0551/('2| Main Inputs'!C28/1000000)), \"-\")","v":"-"},{"$f":"IF('2| Main Inputs'!E24=\"HFO\",('2| Main Inputs'!E26*1.0551/('2| Main Inputs'!E28/1000000)), \"-\")","v":"-"},"[Rs/mmbtu]","[kg/mo]","[kg/Ton]","[kg/hr]","[kg/y]"]
[null,null,"LPG",null,null,null,{"$f":"IF('2| Main Inputs'!C24=\"LPG\",('2| Main Inputs'!C26*1.0551/('2| Main Inputs'!C28/1000000)), \"-\")","v":"-"},{"$f":"IF('2| Main Inputs'!E24=\"LPG\",('2| Main Inputs'!E26*1.0551/('2| Main Inputs'!E28/1000000)), \"-\")","v":"-"},"[Rs/mmbtu]"]
[null,null,"Coal",null,null,null,{"$f":"IF('2| Main Inputs'!C24=\"Coal\",('2| Main Inputs'!C26*1.0551/('2| Main Inputs'!C28/1000000)), \"-\")","v":"-"},{"$f":"IF('2| Main Inputs'!E24=\"Coal\",('2| Main Inputs'!E26*1.0551/('2| Main Inputs'!E28/1000000)), \"-\")","v":{"$error":"#DIV/0!"}},"[Rs/mmbtu]"]
[]
[]
[]
[null,null,"Pressure Conversion"]
[null,null,"[bar g]",1]
[null,null,"[psi]",{"$f":"14.5037738007*D13","v":14.503773800699999}]
[]
{"$rows_left_out":5}
{"sheet":"Steam and Water tables","index":3,"n_rows":107,"n_cols":9,"rows_kept":107,"cut":false,"hidden":true,"merged":[[2,1,2,2],[1,1,1,4],[1,6,1,8],[2,6,2,7]]}
[]
[null,"Water Enthalpy Table",null,null,null,null,"Saturated Steam Enthalpy Table"]
[null,"Temperature",null,"Pressure","Specific enthalpy of liquid water *",null,"Pressure",null,"Specific enthalpy of Saturated Steam as function of Pressure *"]
[null,"°C","°K","Bar","kj/kg",null,"Bar","psi","kj/kg"]
[null,0,{"$f":"_xll.CONVERTIR(B5,\"C\",\"K\")","v":273.14999999999998},1.01325,6.1011961912233389E-2,null,1,{"$f":"'Dropdown & Conversions'!$D$14*'Steam and Water tables'!G5","v":14.503773800699999},2674.9496408321465]
[null,1,{"$f":"_xll.CONVERTIR(B6,\"C\",\"K\")","v":274.14999999999998},1.01325,4.2787080737766559,null,2,{"$f":"'Dropdown & Conversions'!$D$14*'Steam and Water tables'!G6","v":29.007547601399999},2706.2413413742588]
[null,2,275.14999999999998,1.01325,8.4931308535231995,null,3,{"$f":"'Dropdown & Conversions'!$D$14*'Steam and Water tables'!G7","v":43.511321402099995},2724.8916665566517]
[null,3,276.14999999999998,1.01325,12.704552843894799,null,4,{"$f":"'Dropdown & Conversions'!$D$14*'Steam and Water tables'!G8","v":58.015095202799998},2738.0566229312817]
[null,4,277.14999999999998,1.01325,16.913221784309549,null,5,{"$f":"'Dropdown & Conversions'!$D$14*'Steam and Water tables'!G9","v":72.518869003500001},2748.1076146579694]
[null,5,278.14999999999998,1.01325,21.119362979809562,null,6,{"$f":"'Dropdown & Conversions'!$D$14*'Steam and Water tables'!G10","v":87.02264280419999},2756.1388895363325]
[null,6,279.14999999999998,1.01325,25.323181448848768,null,7,{"$f":"'Dropdown & Conversions'!$D$14*'Steam and Water tables'!G11","v":101.52641660489999},2762.7490827695106]
[null,7,280.14999999999998,1.01325,29.52486387039994,null,8,{"$f":"'Dropdown & Conversions'!$D$14*'Steam and Water tables'!G12","v":116.0301904056},2768.3024646637436]
[null,8,281.14999999999998,1.01325,33.724580348957701,null,9,{"$f":"'Dropdown & Conversions'!$D$14*'Steam and Water tables'!G13","v":130.5339642063},2773.0376230707607]
[null,9,282.14999999999998,1.01325,37.922486014257721,null,10,{"$f":"'Dropdown & Conversions'!$D$14*'Steam and Water tables'!G14","v":145.037738007},2777.1195376846622]
[null,10,283.14999999999998,1.01325,42.118722471006052,null,11,{"$f":"'Dropdown & Conversions'!$D$14*'Steam and Water tables'!G15","v":159.5415118077},2780.6671558168696]
{"$rows_left_out":93}
{"sheet":"2| Main Inputs","index":4,"n_rows":42,"n_cols":8,"rows_kept":42,"cut":false,"hidden":false,"merged":[[1,1,1,7],[40,1,40,7],[41,1,41,7],[32,7,33,7],[2,1,2,7],[16,7,17,7],[21,7,24,7]]}
[]
[null,"BOILER PARAMETER INPUTS"]
[null,"ISSUE: Calculating basic parameters of Boilers is time-taking and difficult at times. \n\nWHAT WE DO HERE: Enter basic parameters of boilers, Calculate Boiler Capacity, Steam Enthalpy and Water Enthalpy."]
[null,null,"Example",null,"Steam Production by Boiler"]
[null,null,5.82,null,null,"[Ton/h]",">","From steam flow meter"]
[null,null,null,null,"Surface area of Boiler "]
[null,null,4810,null,null,"[ft²]",">","From boiler Manual if steam flow meter is not installed"]
[null,null,null,null,"Total Energy Generated from Surface Area"]
[null,null,4468.634,null,{"$f":"E7*0.092903*10","v":0},"[kWth]",">","1 m² Surface area = 10 kW"]
[null,null,null,null,"Steam Pressure"]
[null,null,7.5,null,null,"[bar g]",">","From pressure gauge at Boiler output. Select Unit from Dropdown Menu"]
[null,null,null,null,"Steam Temperature"]
[null,null,168,null,null,"[°C]",">"]
[null,null,null,null,"Specific Enthalpy of Steam at Required Pressure [Saturated Vapour]"]
[null,null,2762.75,null,{"$f":"VLOOKUP(E11,'Steam and Water tables'!$G$5:$I$105,3,TRUE)","v":{"$error":"#N/A"}},"[KJ/Kg]",">","Automatically calculated for entered pressure of Saturated Steam"]
{"$rows_left_out":28}
{"sheet":"3| Boiler Cost & Efficiency","index":5,"n_rows":27,"n_cols":8,"rows_kept":27,"cut":false,"hidden":false,"merged":[[1,1,1,7],[21,7,23,7],[25,1,25,7],[26,1,26,7],[2,1,2,7],[16,7,17,7],[18,7,19,7]]}
[]
[null,"BOILER COST AND EFFICIENCY CALCULATIONS "]
[null,"ISSUE: Steam produced is vary expensive form of energy. Efficiency of Boiler is important indicator of its performance.It directly effects the fuel consumption and cost. \n\nWHAT WE DO HERE: Calculate Overall Boiler Efficiency."]
[null,null,null,null,"Steam Cost"]
[null,null,"Example",null,"Quantity of Fuel used per Ton of steam"]
[null,null,{"$f":"'2| Main Inputs'!C33/('2| Main Inputs'!C17*('2| Main Inputs'!C35/12))","v":109.11201794578082},null,{"$f":"'2| Main Inputs'!E33/('2| Main Inputs'!E17*('2| Main Inputs'!E35/12))","v":{"$error":"#N/A"}},{"$f":"IF('2| Main Inputs'!E24=\"Natural Gas\",'Dropdown & Conversions'!K5,'Dropdown & Conversions'!K6)","v":"[kg/Ton]"},">","The unit automatically changes based on fuel selected."]
[null,null,null,null,"Hourly fuel consumption "]
[null,null,{"$f":"C6*'2| Main Inputs'!C17","v":635.03194444444443},null,{"$f":"E6*'2| Main Inputs'!E17","v":{"$error":"#N/A"}},{"$f":"IF('2| Main Inputs'!E24=\"Natural Gas\",'Dropdown & Conversions'!L5,'Dropdown & Conversions'!L6)","v":"[kg/hr]"},">","Sm3 of gas, KG of oil or LPG /coal"]
[null,null,null,null,"Cost of production per hour "]
[null,null,34148,null,{"$f":"IF('2| Main Inputs'!E24=\"Natural Gas\",E8*'Dropdown & Conversions'!$H$5,IF('2| Main Inputs'!E24=\"HFO\",E8*'2| Main Inputs'!E26,IF('2| Main Inputs'!E24=\"LPG\",E8*'2| Main Inputs'!E26,IF('2| Main Inputs'!E24=\"Coal\",E8*'2| Main Inputs'!E26,\"select fuel in Main Inputs\"))))","v":{"$error":"#N/A"}},"[Rs/ Hr]",">","(Without maintenance and Overheads) "]
[null,null,null,null,"Cost of steam (Only fuel cost)"]
[null,null,2277,null,{"$f":"E10/'2| Main Inputs'!E17","v":{"$error":"#N/A"}},"[Rs/Ton]",">","(Without maintenance and Overheads) "]
[null,null,null,null,"Cost of steam (Only fuel cost)"]
[null,null,274553049.76999998,null,{"$f":"E10*'2| Main Inputs'!E35","v":{"$error":"#N/A"}},"[Rs/y]",">","(Without maintenance and Overheads) "]
[null,null,null,null,"Boiler Efficiency"]
{"$rows_left_out":13}
{"sheet":"4| Combustion Efficiency","index":6,"n_rows":52,"n_cols":9,"rows_kept":52,"cut":false,"hidden":false,"merged":[[1,1,1,7],[44,5,44,7],[45,5,45,7],[46,5,46,7],[18,7,19,7],[41,1,41,7],[2,1,2,7],[6,7,7,7],[51,1,51,7],[50,1,50,7],[16,7,17,7],[47,5,47,7],[48,5,48,7],[49,5,49,7],[42,5,42,7],[43,5,43,7],[36,7,37,7]]}
[]
[null,"CALCULATING COMBUSTION EFFICIENCY OF BOILER"]
[null,"ISSUE: Steam is expensive form of energy used in different process and also to produce electricity, To produced steam at optimum cost, Boiler should run at optimum efficiency by reducing the excess air supplied for combustion.  \n\nWHAT WE DO HERE: Calculate the Stoichiometric Excess Air, Loss Factors, and Combustion Efficiency of the boiler."]
[null,null,"Example",null,"Fuel Heating Value (Btu/lb)"]
[null,null,10815,null,{"$f":"IF('2| Main Inputs'!E24=\"Natural Gas\", ('2| Main Inputs'!E28*35.3/0.78*0.45), ('2| Main Inputs'!E28/1.0551)/2.2)","v":0},"[btu/lb]",">","Depends upon fuel selection"]
[null,null,null,null,"%age of Flue gas Oxygen\n (Stack analysis (by volume, dry))"]
[null,null,0.09,null,null,"[%]",">","%age of oxygen using oxygen sensor or stack analyzer\n[Ideal Oxygen % is 2~3% for Natural Gas and LPG, 3.41% for HFO, 15~25% for Coal]"]
[null,null,null,null,"Stoichiometric Excess air % "]
[null,null,0.43730000000000002,null,{"$f":"+E7*100/(20.9-E7)","v":0},"[%]",">","= % Oxygen ÷ (20.9 - % Oxygen) "]
[null,null,null,null,"Hydrogen content in fuel % "]
[null,null,5.0000000000000001E-3,null,null,"[%]",">","%age of Hydrogen in fuel. Moisture x 0.1119"]
[null,null,null,null,"Sulphur content in Fuel % "]
[null,null,4.4999999999999997E-3,null,null,"[%]",">","%age of Sulphur. See Safety Data Sheet of fule or contact supplier."]
[null,null,null,null,"% Carbon monoxide in exhaust gases "]
[null,null,5.9999999999999995E-4,null,null,"[%]",">","%age of CO using stack analyzer = CO ppm ÷ 10,000"]
{"$rows_left_out":38}
{"sheet":"5| Steam Leakage Calculation","index":7,"n_rows":19,"n_cols":8,"rows_kept":19,"cut":false,"hidden":false,"merged":[[1,1,1,7],[2,1,2,7],[18,1,18,7],[17,1,17,7]]}
[]
[null,"STEAM LEAKAGE COST CALCULATION BY USING SIZE OF ORIFICE"]
[null,"ISSUE: A considerable amount of steam is wasted through leaks in the steam distribution system and equipments. This wastage of energy can be saved through proper leakage management program.\n\nWHAT WE DO HERE: Calculate the cost of steam leakge through orifices of different sizes."]
[null,null,"Example",null,"Approximate diameter of orifice"]
[null,null,3.125E-2,null,null,"[In]",">","Enter orifice dia from which steam leaks"]
[null,null,null,null,"Line Pressure"]
[null,null,4,null,null,"[bar g]",">","Pressure in the line where leakage is detected"]
[null,null,null,null,"Amount of steam loss per hour"]
[null,null,1.72,null,{"$f":"+(24.24*((E7*'Dropdown & Conversions'!$D$14)+14.7)*(E5^2))","v":0},"[lb/h]",">","[=24.24 x (gauge pressure in psi + atm pressure in psi) x (Orifice Dia)²"]
[null,null,null,null,"Amount of steam loss per hour"]
[null,null,7.8099031045997323E-4,null,{"$f":"E9/2204","v":0},"[Ton/yr]",">","Amount of steam loss per hour[lb/h] / 2204"]
[null,null,null,null,"Amount of steam loss per year"]
[null,null,6.3,null,{"$f":"E11*'2| Main Inputs'!E35","v":0},"[Ton/yr]",">","Amount of steam loss per hour[T/h] x Annual operation Hours"]
[null,null,null,null,"Cost of steam loss per year"]
[null,null,14295,null,{"$f":"E13*'3| Boiler Cost & Efficiency'!E12","v":{"$error":"#N/A"}},"[Rs/y]",">","Amount of steam loss per year[T/y] x Average steam cost per ton[Rs/T]"]
{"$rows_left_out":5}
{"sheet":"6| Insulation Thickness + Cost","index":8,"n_rows":76,"n_cols":8,"rows_kept":76,"cut":false,"hidden":false,"merged":[[75,1,75,7],[51,7,52,7],[74,1,74,7],[2,1,2,7],[6,7,7,7],[16,7,17,7],[18,7,19,7],[1,1,1,7],[49,4,49,5],[43,4,43,5],[44,7,45,7],[45,4,45,5],[34,4,34,5],[9,4,9,5],[11,4,11,5],[4,4,4,5],[15,4,15,5]]}
[]
[null,"CALCULATE REQUIRED INSULATION THICKNESS & COST"]
[null,"ISSUE: Considerable energy loss occurs due to heat loss in distribution system (Piping without insulation).\n\nWHAT WE DO HERE: Calculate required insulation thickness and energy saving potential."]
[]
[null,null,null,null,"Heat Loss through Uninsulated Pipes"]
[null,null,"Example",null,"Dia of pipe"]
[null,null,16,null,null,"[In]",">","Enter dia of pipe containing fluid"]
[null,null,null,null,"Uninsulated Pipe Length"]
[null,null,20,null,null,"[ft]",">","Enter length of uninsulated pipe "]
[null,null,null,null,"Surface area of pipe"]
[null,null,83.73,null,{"$f":"(2*3.14*E9/2/12*E7)","v":0},"[ft²]",">","Surface area of pipe "]
[null,null,null,null,"Surface Temp (Ts)"]
[null,null,101,null,null,"[°C]",">","Temperature of pipe"]
[null,null,null,null,"Ambient Temp (Ta)"]
[null,null,35,null,null,"[°C]",">","Ambiant temperature where pipe is installed"]
{"$rows_left_out":62}
{"sheet":"7| Condensate Recovery","index":9,"n_rows":33,"n_cols":8,"rows_kept":33,"cut":false,"hidden":false,"merged":[[1,1,1,7],[2,1,2,7],[31,1,31,7],[32,1,32,7]]}
[]
[null,"COST SAVING THROUGH CONDENSATE RECOVERY "]
[null,"ISSUE: Condensate contains valuable energy in it. It must be recovered to maximize boiler efficiency. Moreover it also reduced the water and water treatment costs as well. \n\nWHAT WE DO HERE: Calculate the  energy saving by condensate recovery."]
[null,null,"Example",null,"Quantity of condensate water recovered per hour "]
[null,null,8500,null,null,"[kg/h]",">","Condensate water recovered in one hour"]
[null,null,null,null,"% condensate water "]
[null,null,0.56669999999999998,null,{"$f":"(E5/1000)/'2| Main Inputs'!E17","v":{"$error":"#N/A"}},"[%]",">","% of condensate recovered against total water consumption"]
[null,null,null,null,"% make-up water "]
[null,null,{"$f":"1-C7","v":0.43330000000000002},null,{"$f":"1-E7","v":{"$error":"#N/A"}},"[%]",">","% of condensate recovered against total water consumption"]
[null,null,null,null,"Temperature of Condensate water "]
[null,null,95,null,null,"[°C]",">","Temperature at which condensate water is recovered"]
[null,null,null,null,"Temperature of makeup water"]
[null,null,33,null,null,"[°C]",">","Ambiant temperature of make up water"]
[null,null,null,null,"Estimated Temperature of Feed water"]
[null,null,68,null,{"$f":"SUM(E11*E7+E13*E9)/(E7+E9)","v":{"$error":"#N/A"}},"[°C]",">","Temperature of feed water after mixing condensate and makeup water"]
{"$rows_left_out":19}
{"sheet":"8| Economizer","index":10,"n_rows":27,"n_cols":8,"rows_kept":27,"cut":false,"hidden":false,"merged":[[26,1,26,7],[9,4,9,5],[7,4,7,5],[2,1,2,7],[3,4,3,5],[19,4,19,5],[21,4,21,5],[25,1,25,7],[16,7,17,7],[18,7,19,7]]}
[]
[null,"POTENTIAL SAVING BY INSTALLING ECONOMIZER"]
[null,"ISSUE: Steam is expensive form of energy used in different process . To produced steam at optimum cost, economizer has important role to recover waste heat from stack and increases the efficiency of Boiler, and thus cuts cost of boiler's operation.\n\nWHAT WE DO HERE: Calculate the potential energy saving by installation of economizer. "]
[null,null,"Example",null,"%age of Flue gas Oxygen by Stack analysis (by volume, dry) "]
[null,null,0.02,null,null,"[%]",">","Enter data from \"4| Combustion Efficiency\" if same"]
[null,null,null,null,"Combustion air temperature at Inlet"]
[null,null,40,null,null,"[°C]",">","Enter data from \"4| Combustion Efficiency\" if same"]
[null,null,null,null,"Current Exhaust gas stack temperature"]
[null,null,250,null,null,"[°C]",">","Enter data from \"4| Combustion Efficiency\" if same"]
[null,null,null,null,"Proposed Exhaust gas stack temperature"]
[null,null,200,null,null,"[°C]",">","Target Exhaust gas/Flu gas temperature"]
[null,null,null,null,"Current stack Temerature rise"]
[null,null,378,null,{"$f":"CONVERT(E9,\"C\",\"F\")-CONVERT(E7,\"C\",\"F\")","v":0},"[°F]",">","Current Difference of temperature of gases at inlet and outlet"]
[null,null,null,null,"Proposed stack temerature rise"]
[null,null,288,null,{"$f":"CONVERT(E11,\"C\",\"F\")-CONVERT(E7,\"C\",\"F\")","v":0},"[°F]",">","Proposed Difference of temperature of gases at inlet and outlet"]
{"$rows_left_out":12}